{"text_format":"1","workbook":"xlsx","n_sheets":4,"sheets":["Needs Assessment","Criteria","APAC Indices","DRI Database"],"not_rendered":{"charts":0,"images":1,"macros":1,"external_links":0,"defined_names":36,"comments":0,"pivot_tables":0},"unopened":[],"bounds":{"document_bytes":16777216,"sheet_cells":100000,"rows_first":2000,"rows_last":500,"rows_between":2000,"halvings":0,"cell_chars":16384,"cell_head_chars":4096},"cells_cut":0,"cells_raw":0,"read":"whole","date_system":"1900"}

{"sheet":"Needs Assessment","index":0,"n_rows":133,"n_cols":25,"rows_kept":133,"cut":false,"hidden":false,"merged":[[58,17,58,19],[50,3,50,15],[53,16,53,20],[61,3,61,15],[34,17,34,19],[46,3,46,15],[49,17,49,19],[54,17,54,19],[55,17,55,19],[56,17,56,19],[57,17,57,19],[38,16,38,20],[79,3,79,15],[103,17,103,19],[111,17,111,19],[115,17,115,19],[119,17,119,19],[103,3,103,15],[107,17,107,19],[99,17,99,19],[112,3,112,15],[116,3,116,15],[72,17,72,19],[79,17,79,19],[83,17,83,19],[91,17,91,19],[95,17,95,19],[73,17,73,19],[74,17,74,19],[75,17,75,19],[133,3,133,15],[39,17,39,19],[40,17,40,19],[41,17,41,19],[42,17,42,19],[43,17,43,19],[44,17,44,19],[45,17,45,19],[92,3,92,15],[96,3,96,15],[100,3,100,15],[108,3,108,15],[76,3,76,15],[80,3,80,15],[84,3,84,15],[87,17,87,19],[65,3,65,15],[69,3,69,15],[59,17,59,19],[60,17,60,19],[64,17,64,19],[68,17,68,19],[64,3,64,15],[4,3,5,19],[8,17,8,19],[30,17,30,19],[31,3,31,15],[11,17,11,19],[15,19,15,20],[18,17,18,19],[25,3,27,15],[22,17,22,19],[23,3,23,15],[26,17,26,19]]}
[]
[]
[null,null,null,"DIGITAL TWIN NEEDS ASSESSMENT"]
[null,null,null,"Objective : This form provides a preliminary assessment on whether a Digital Twin should be considerd for the respective project, based on three key pillars (knowledge, capacity, and strategic fit)"]
[null,null,null,"Instructions\n(1) This assessment should be shared by ADB Project Officers and teams, to their respective project counterparts (\"Counterparts\") to fill out. \n(2) Counterparts may be the Project Managmeent Office (PMO), Project Manager(s) and/or equivalent in the DMC Implementing Agency that is considering implementing a Digital Twin for their project.\n(3) Counterparts should fill all cells in yellow to the best of their ability, based on the information available. Counterparts can revisit this assessment at any time, in case there is new or additional information.\n(4) Upon completion of all questions, a preliminary assessment will be provided in row 12. \n(5) If output is \"Yes\" you should proceed to Digital Twin Roadmap. If output is \"Needs further consideration\" you should visit \"Further Consideration\" tab."]
[]
[]
[]
[null,null,null,null,null,null,null,null,null,null,null,null,null,null,null,null,null,"Please fill all cells in yellow below"]
[]
[]
[null,null,null,"*Should a Digital Twin be considered for your project?*",null,null,null,null,null,null,null,null,null,null,null,null,null,{"$f":"IF(COUNTIF($V$23:$V$120,FALSE)=COUNTA($V$23:$V$120),IF($Y$12>=50%,\"Yes\",\"Need further consideration\"),\"Assessment Pending\")","v":"Assessment Pending"},null,null,null,null,null,null,{"$f":"SUM(Y23,Y27,Y31,Y39,Y50,Y54,Y65,Y69,Y73,Y80,Y84,Y92,Y96,Y100,Y104,Y108,Y112,Y116,Y120)","v":0}]
[]
[]
[]
[]
[]
[]
[null,null,"PART 1: KNOWLEDGE",null,null,null,null,null,null,null,null,null,null,null,null,null,null,null,null,null,null,"Filled?","Value","Weight","Score"]
[]
[]
[]
[null,null,"Q1.)","How familiar are you with the concept of a Digital Twin?",null,null,null,null,null,null,null,null,null,null,null,null,null,null,null,null,null,{"$f":"ISBLANK(R23)","v":true},{"$f":"IFERROR(VLOOKUP(R23,Criteria!C13:D16,2,FALSE),\"-\")","v":"-"},{"$f":"(100%/3)/COUNTA($C$21:$C$33)","v":0.1111111111111111},{"$f":"IFERROR(X23*W23,0)","v":0}]
[]
[]
[null,null,null,"Does your current understanding and definition of a 'Digital Twin' match the definition and context used in the ADB Digital Twin framework?"]
[null,null,"Q2.)",null,null,null,null,null,null,null,null,null,null,null,null,null,null,null,null,null,null,{"$f":"ISBLANK(R27)","v":true},{"$f":"IFERROR(VLOOKUP(R27,Criteria!C3:D5,2,FALSE),\"-\")","v":"-"},{"$f":"(100%/3)/COUNTA($C$21:$C$33)","v":0.1111111111111111},{"$f":"IFERROR(X27*W27,0)","v":0}]
[]
[]
[]
[null,null,"Q3.)","IoT plays a very significant role in Digital Twins. Please share your level of familiarity with IoT.",null,null,null,null,null,null,null,null,null,null,null,null,null,null,null,null,null,{"$f":"ISBLANK(R31)","v":true},{"$f":"IFERROR(VLOOKUP(R31,Criteria!C12:D56,2,FALSE),\"-\")","v":"-"},{"$f":"(100%/3)/COUNTA($C$21:$C$33)","v":0.1111111111111111},{"$f":"IFERROR(X31*W31,0)","v":0}]
[]
[]
[]
[null,null,"PART 2: CAPACITY",null,null,null,null,null,null,null,null,null,null,null,null,null,null,null,null,null,null,null,"Value","Weight","Score"]
[]
[]
[]
[null,null,"Q4.)","Have you had any experience working with or developing any of these enabling technologies in the past?",null,null,null,null,null,null,null,null,null,null,null,null,"Please select from the list below",null,null,null,null,null,{"$f":"IFERROR(SUM($W$40:$W$46)/COUNTA(D40:D46),\"-\")","v":0},{"$f":"(100%/3)/COUNTA($C$37:$C$86)","v":4.1666666666666664E-2},{"$f":"IFERROR(X39*W39,0)","v":0}]
[null,null,null,"↳ Data Modeling and Visualization (BIM, 2D/3D modeling, CAD, etc.)",null,null,null,null,null,null,null,null,null,null,null,null,null,null,null,null,null,{"$f":"ISBLANK(R40)","v":true},{"$f":"IFERROR(VLOOKUP(R40,Criteria!$C$3:$D$5,2,FALSE),\"-\")","v":"-"}]
{"$rows_left_out":94}
{"sheet":"Criteria","index":1,"n_rows":94,"n_cols":7,"rows_kept":94,"cut":false,"hidden":true,"merged":[]}
[]
[null,"Answer Format","Answers","Assigned Value"]
[null,"Close-ended question","Yes",1]
[null,null,"No",0]
[null,null,"Uncertain",0.5]
[]
[null,"Answer Format","Answers","Assigned Value"]
[null,"Close-ended question (somewhat)","Yes",1]
[null,null,"No",0]
[null,null,"Somewhat",0.5]
[]
[null,"Question","Answers","Assigned Value"]
[null,"How familiar are you with the concept of a Digital Twin?","Confident",1]
[null,null,"Fairly familiar",0.6]
[null,null,"Basic understanding",0.3]
[null,null,"Digital Twins are new to me",0]
[null,"At what level of capacity and capability do your envision your team to have by the end of the project?","Build Digital Twins","NA"]
[null,null,"Outsource the development of Digital Twins","NA"]
[null,null,"Maintain and operate Digital Twins","NA"]
[null,"What do you want to accomplish by implementing a Digital Twin?","Visualization and monitoring"]
[null,null,"Informed decision-making"]
[null,null,"Resource optimization and loss reduction"]
[null,null,"Productivity gains"]
[null,null,"Improve operations, inspection, maintenance"]
[null,null,"Improve or optimize financial performance"]
[null,null,"Improve quality"]
[null,null,"Increase customer satisfaction"]
[null,null,"Improved knowledge and collaboration"]
[null,null,"Security and Safety"]
[null,null,"Predictive intelligence"]
[null,null,"Risk management and resilience"]
[null,null,"Improved environmental sustainability"]
[null,null,"Others (Please specify)"]
[null,"Which sector is your project under?","Water and Urban Development",1]
[null,null,"Transport",0.5844155844155845]
[null,null,"Energy",0.45454545454545459]
[null,null,"Industry and Trade",0.61038961038961048]
[null,null,"Agriculture, food, nature, and rural development",0.2207792207792208]
[null,null,"Human and social development (covering education, health, and social development)",2.0738556942079447E-2]
[null,null,"Public sector management and governance",5.1948051948051951E-2]
{"$rows_left_out":55}
{"sheet":"APAC Indices","index":2,"n_rows":50,"n_cols":21,"rows_kept":50,"cut":false,"hidden":true,"merged":[]}
[]
[null,"CISCO Digital Readiness Index",null,null,null,null,null,null,null,null,null,null,null,null,null,null,"WorldRiskIndex 2023"]
[null,"Digital Readiness Index 2021 (cisco.com)",null,null,null,null,null,null,null,null,null,null,null,null,null,null,"WRR_2023_english_online161023.pdf (weltrisikobericht.de)"]
[]
[null,"Range","Score","Criteria","Score",null,"Range","Score","Criteria","Score",null,"Range","Score","Criteria","Score",null,"Classification","Range","Score","Criteria","Score"]
[null,"<-1",0,{"$f":"_xlfn.PERCENTILE.INC($D$14:$D$40,0%)","v":-2.1978086279147599},0,null,"<-1",0,{"$f":"_xlfn.PERCENTILE.INC($I$14:$I$40,0%)","v":-1.6448723734290152},0,null,"<-1",0,{"$f":"_xlfn.PERCENTILE.INC($N$14:$N$40,0%)","v":-1.3093191678174447},0,null,"Very low","0.00 - 1.84",0,-10,0]
[null,"-1 - -0.5",0.25,{"$f":"_xlfn.PERCENTILE.INC($D$14:$D$40,20%)","v":-0.94138310805794234},0.25,null,"-1 - -0.5",0.25,{"$f":"_xlfn.PERCENTILE.INC($I$14:$I$40,20%)","v":-0.9397686249421805},0.25,null,"-1 - -0.5",0.25,{"$f":"_xlfn.PERCENTILE.INC($N$14:$N$40,20%)","v":-1.0598758852124812},0.25,null,"Low","1.85 - 3.2",0.25,1.84,0.25]
[null,"-0.5 - 0.5",0.5,{"$f":"_xlfn.PERCENTILE.INC($D$14:$D$40,40%)","v":-0.24001396848748022},0.5,null,"-0.5 - 0.5",0.5,{"$f":"_xlfn.PERCENTILE.INC($I$14:$I$40,40%)","v":-0.41083975270148165},0.5,null,"-0.5 - 0.5",0.5,{"$f":"_xlfn.PERCENTILE.INC($N$14:$N$40,40%)","v":-0.70659605357035482},0.5,null,"Medium","3.21 - 5.87",0.5,3.2,0.5]
[null,"0.5 - 1",0.75,{"$f":"_xlfn.PERCENTILE.INC($D$14:$D$40,60%)","v":0.15993237223934073},0.75,null,"0.5 - 1",0.75,{"$f":"_xlfn.PERCENTILE.INC($I$14:$I$40,60%)","v":-6.0792310669556038E-2},0.75,null,"0.5 - 1",0.75,{"$f":"_xlfn.PERCENTILE.INC($N$14:$N$40,60%)","v":-9.0754026019500278E-2},0.75,null,"High","5.88 - 12.88",0.75,5.87,0.75]
[null,">1",1,{"$f":"_xlfn.PERCENTILE.INC($D$14:$D$40,80%)","v":0.48409013276875668},1,null,">1",1,{"$f":"_xlfn.PERCENTILE.INC($I$14:$I$40,80%)","v":0.21838524624251612},1,null,">1",1,{"$f":"_xlfn.PERCENTILE.INC($N$14:$N$40,80%)","v":0.1014464332307094},1,null,"Very High","12.89 - 100",1,12.88,1]
[]
[null,"HUMAN CAPITAL",null,null,null,null,"TECHNOLOGY ADOPTION",null,null,null,null,"TECHNOLOGY INFRASTRUCTURE",null,null,null,null,"WorldRiskIndex"]
[null,"Rank","Country","Human","Score",null,"Rank","Country","Adoption","Score",null,"Rank","Country","Infrastructure","Score",null,"Rank","Country","WRI","Score","Class"]
[null,1,"Vietnam",1.1110141705083474,{"$f":"VLOOKUP(D14,$D$5:$E$10,2,TRUE)","v":1},null,1,"Thailand",0.73325296580406052,{"$f":"VLOOKUP(I14,$I$5:$J$10,2,TRUE)","v":1},null,1,"Malaysia",0.42911007661374229,{"$f":"VLOOKUP(N14,$N$5:$O$10,2,TRUE)","v":1},null,1,"Philippines",46.86,{"$f":"VLOOKUP(S14,$T$5:$U$10,2,TRUE)","v":1},{"$f":"INDEX($Q$6:$U$10,MATCH(T14,$U$6:$U$10),1)","v":"Very High"}]
[null,2,"Kazakhstan",0.7047978071644988,1,null,2,"Malaysia",0.58174942265031138,1,null,2,"China",0.38427985689063804,1,null,2,"Indonesia",43.5,1,{"$f":"INDEX($Q$6:$U$10,MATCH(T15,$U$6:$U$10),1)","v":"Very High"}]
[null,3,"Georgia",0.59451576583086052,1,null,3,"Kazakhstan",0.4189916570603392,1,null,3,"Georgia",0.34084057752135288,1,null,3,"India",41.52,1,"Very High"]
[null,4,"Uzbekistan",0.58988726041916606,1,null,4,"Vietnam",0.29334991935457211,1,null,4,"Thailand",0.23721331021911429,1,null,4,"Myanmar",36.159999999999997,1,"Very High"]
[null,5,"Malaysia",0.50111802868219291,1,null,5,"Cambodia",0.2619013184260624,1,null,5,"Kazakhstan",0.21039424874620205,1,null,5,"Bangladesh",27.29,1,"Very High"]
[null,6,"Mongolia",0.48744239468763545,1,null,6,"China",0.23661252455815032,1,null,6,"Azerbaijan",0.10293382164772057,1,null,6,"China",27.1,1,"Very High"]
[null,7,"China",0.47068108509324152,0.75,null,7,"Georgia",0.14547613297997902,0.75,null,7,"Vietnam",9.5496879562664713E-2,0.75,null,7,"Pakistan",26.45,1,"Very High"]
[null,8,"Azerbaijan",0.36951202844248676,0.75,null,8,"Philippines",0.11503310853806092,0.75,null,8,"Kyrgyzstan",8.3647786669461419E-2,0.75,null,8,"Papua New Guinea",26.3,1,"Very High"]
[null,9,"Thailand",0.35614246792015336,0.75,null,9,"Mongolia",6.5683242907394829E-2,0.75,null,9,"Uzbekistan",7.6340333683805953E-2,0.75,null,9,"Vietnam",24.39,1,"Very High"]
[null,10,"Cambodia",0.31120510353146602,0.75,null,10,"Azerbaijan",-2.647702509628409E-2,0.75,null,10,"Armenia",6.0484507911412036E-2,0.75,null,10,"Thailand",21.09,1,"Very High"]
[null,11,"Indonesia",0.17184062343256637,0.75,null,11,"Armenia",-5.5731797801766458E-2,0.75,null,11,"Indonesia",-8.2119510619608038E-2,0.75,null,11,"Malaysia",14.04,1,"Very High"]
[null,12,"Kyrgyzstan",0.14206999544950216,0.5,null,12,"Indonesia",-6.8383079971240449E-2,0.5,null,12,"Mongolia",-0.10370579911933872,0.5,null,12,"Cambodia",8.19,0.75,"High"]
[null,13,"Armenia",0.11926063263605925,0.5,null,13,"Uzbekistan",-0.21138306771573095,0.5,null,13,"Cambodia",-0.1377784130065578,0.5,null,13,"Timor-Leste",7.79,0.75,"High"]
[null,14,"Laos",-0.1381884602332703,0.5,null,14,"Sri Lanka",-0.22769212218512355,0.5,null,14,"Sri Lanka",-0.33178924503043766,0.5,null,14,"Sri Lanka",5.92,0.75,"High"]
[null,15,"Sri Lanka",-0.22134937180642023,0.5,null,15,"Kyrgyzstan",-0.26954697153140139,0.5,null,15,"Bangladesh",-0.66814876053193994,0.5,null,15,"Afghanistan",4.0199999999999996,0.5,"Medium"]
[null,16,"Philippines",-0.23184199732813912,0.5,null,16,"Nepal",-0.44527917348120244,0.25,null,16,"Myanmar",-0.7322275822626314,0.25,null,16,"Georgia",3.69,0.5,"Medium"]
[null,17,"Nepal",-0.38545237482226091,0.25,null,17,"Myanmar",-0.69814323352109653,0.25,null,17,"Philippines",-0.73615397806325866,0.25,null,17,"Laos",2.79,0.25,"Low"]
[null,18,"Tajikistan",-0.66476832089468851,0.25,null,18,"Timor-Leste",-0.7616393665917377,0.25,null,18,"India",-0.78161760379540046,0.25,null,18,"Armenia",2.61,0.25,"Low"]
[null,19,"Timor-Leste",-0.73415890329916667,0.25,null,19,"Tajikistan",-0.76322703252592672,0.25,null,19,"Pakistan",-0.87685595412800788,0.25,null,19,"Nepal",2.57,0.25,"Low"]
[null,20,"Myanmar",-0.76130283390695808,0.25,null,20,"India",-0.798903475068242,0.25,null,20,"Nepal",-0.93490529331297301,0.25,null,20,"Tajikistan",2.4700000000000002,0.25,"Low"]
[null,21,"Bangladesh",-0.98640317659568844,0,null,21,"Bangladesh",-0.97498491241066521,0,null,21,"Tajikistan",-1.0911185331873583,0,null,21,"Kyrgyzstan",2.42,0.25,"Low"]
[null,22,"India",-1.1033329965592085,0,null,22,"Pakistan",-1.1918279826966087,0,null,22,"Laos",-1.1033021990751655,0,null,22,"Kazakhstan",2.15,0.25,"Low"]
[null,23,"Papua New Guinea",-1.7555445846891486,0,null,23,"Laos",-1.2790289459108648,0,null,23,"Timor-Leste",-1.1072437204986605,0,null,23,"Mongolia",2.11,0.25,"Low"]
[null,24,"Pakistan",-1.8864946525240405,0,null,24,"Afghanistan",-1.5703700221610619,0,null,24,"Afghanistan",-1.2995669802655223,0,null,24,"Azerbaijan",2.09,0.25,"Low"]
[null,25,"Afghanistan",-2.1978086279147599,0,null,25,"Papua New Guinea",-1.6448723734290152,0,null,25,"Papua New Guinea",-1.3093191678174447,0,null,25,"Uzbekistan",1.52,0,"Very low"]
[null,"-","Pacific Islands",{"$f":"AVERAGE(D32,D36)","v":-1.2448517439941575},0,null,"-","Pacific Islands",{"$f":"AVERAGE(I31,I38)","v":-1.2032558700103764},0,null,"-","Pacific Islands",{"$f":"AVERAGE(N36,N38)","v":-1.2082814441580525},0,null,"-","Pacific Islands",{"$f":"AVERAGE(T42:T50)","v":5.4633333333333329},0.5,"Medium"]
[null,"-","Other",{"$f":"AVERAGE(D14:D39)","v":-0.24546194926037429},0.25,null,"-","Other",{"$f":"AVERAGE(I14:I39)","v":-0.35918062153190056},0.5,null,"-","Other",{"$f":"AVERAGE(N14:N39)","v":-0.40320741482331707},0.5,null,"-","Other",{"$f":"AVERAGE(S14:S39)","v":15.019358974358973},1,"Very High"]
{"$rows_left_out":11}
{"sheet":"DRI Database","index":3,"n_rows":147,"n_cols":13,"rows_kept":147,"cut":false,"hidden":true,"merged":[]}
["Country","Small island? (Y/N)","Region","AAA Group","Overall DRI Score","Basic Needs","Business & Government Investment","Ease of Doing Business","Human Capital",null,"Start-Up Environment","Technology Adoption","Technology Infrastructure"]
["Singapore",null,"Asia Pacific","Amplify",2.3657188097737674,0.93481940582522927,1.8257346366175433,1.6936207539587997,1.6706566706744819,null,4.1606421822288073,2.097670671478161,1.9481118564452298]
["Luxembourg",null,"Western Europe","Amplify",2.2178522650187311,0.88571321330107977,1.3075353868833828,1.1624148408072852,0.86575516354783999,null,5.7802313093012527,2.1614920996419373,1.2723554099277887]
["Iceland",null,"Western Europe","Amplify",2.153958928971984,0.91903312129536985,4.4384766345317566,1.3377345053888379,1.5820883701501207,null,1.754982521001498,1.3371020619659602,1.6790216275073775]
["United States of America",null,"North America","Amplify",2.0839467293092317,0.74320671573201891,2.1901067177418123,1.0549365580901189,1.2020697897085022,null,2.1903563701039817,3.014793635976039,2.2288430912704835]
["Sweden",null,"Western Europe","Amplify",1.9520365781490243,0.90668533670026052,3.4439913434884901,1.5053696268910737,1.3757719853999142,null,1.9306246116626411,1.327175379058976,1.3355978638727588]
["Denmark",null,"Western Europe","Amplify",1.8151676331577584,0.83157615995211343,1.5985231124241106,1.8373204019569578,1.29143013128227,null,0.81006543930101038,1.1858312746041904,3.4413330855126207]
["South Korea",null,"Asia Pacific","Amplify",1.7338865819400917,0.90779778814954692,1.7883833085312761,1.5396416313832493,1.3125312729760434,null,2.555570815027485,1.2847244169546144,1.1150389844368993]
["New Zealand",null,"Asia Pacific","Amplify",1.6956371194839026,0.86978784730860381,2.2610407770231578,1.6320346014543452,1.5779000313307441,null,1.83001098059113,1.1556908522966816,0.94551222299859206]
["Switzerland",null,"Western Europe","Amplify",1.640247495447666,0.9270062698183601,1.8081586804762415,1.4650953413997987,1.4323306194179963,null,0.98784296613990896,1.3849484085095638,1.9310509683514865]
["United Kingdom",null,"Western Europe","Amplify",1.5850170960657102,0.84285317271552129,2.1098736698997378,1.4359569766631677,1.3506954504451003,null,1.6887422964497105,0.96970191204846889,1.2040302818945898]
["Estonia",null,"Eastern Europe","Amplify",1.5718733971658878,0.7684781915093426,0.56750451035692184,1.2472610628531655,1.3886344135528015,null,2.7904792157292233,0.97643893436964313,1.7834343948603881]
["Netherlands",null,"Western Europe","Amplify",1.5662290030212622,0.87590349707032311,2.1822520280801201,1.0912632921440684,1.3565819451672694,null,0.57011611598280465,1.1991482404237763,2.2127725049475551]
["Norway",null,"Western Europe","Amplify",1.5440695157182565,0.89464258249683626,1.9589509791622903,1.5188313168820275,1.3509572502086671,null,0.92821835556398491,1.4317105257383438,1.2704869535034757]
["Ireland",null,"Western Europe","Amplify",1.5433306342729838,0.84149987909970025,2.0475503654991138,1.3445290827218221,1.2956125945045864,null,0.98499425900586601,1.2295195675442077,1.6056161552052135]
["Finland",null,"Western Europe","Amplify",1.5305676157419361,0.87720832603782428,2.2223982361843491,1.6493429815295482,1.3046749304022061,null,0.31321715989591459,1.1645382967929931,1.7406250543416766]
["Australia",null,"Asia Pacific","Amplify",1.4875432763982661,0.918583643653058,1.5405548555282156,1.2395953457791655,1.3908664293809831,null,1.7752894092045193,0.96855080299153518,1.1779279316794262]
["Canada",null,"North America","Amplify",1.402475325273185,0.87383798318062922,1.4916296926284724,0.94014684574826912,1.3973210769433806,null,0.6080752471415638,2.1344114231714526,1.0506141517841705]
["Japan",null,"Asia Pacific","Amplify",1.3451364171225562,0.97083451515220986,0.95130328681700294,1.0429377519636531,1.2789191094879961,null,0.92455213474232634,1.2871957779393628,1.6929412435716094]
["Germany",null,"Western Europe","Amplify",1.331848106688807,0.84578793146952835,1.600144327381342,1.4724668463617203,1.2866234628002027,null,7.6689901530854337E-2,1.1823268952413635,1.6041453777368648]
["Israel",null,"Middle East","Amplify",1.3113148844596194,0.90232994945206779,1.8902983250411005,0.68095306594767324,1.0275309072877099,null,2.3214620876419487,0.4335645377268138,0.68765793849434798]
["United Arab Emirates",null,"Middle East","Amplify",1.2605654019547359,0.69721503112665195,1.3725444094168162,1.2671420827712498,1.2130278257594167,null,0.15665901867975213,1.2942355851786698,1.6355382507782126]
["Austria",null,"Western Europe","Amplify",1.1021456813061297,0.85734707428958279,1.5678632632277929,1.4444097981749151,1.0590560162906484,null,-0.18057873948427325,1.0226183903055177,0.90595770470129799]
["Spain",null,"Western Europe","Amplify",0.9985499856297515,0.92863267660844628,1.798884089356191,0.91179194484111914,0.82976276121424064,null,-0.17241109138926175,0.81796193762431857,0.93448021696808392]
["Cyprus",null,"Eastern Europe","Accelerate High",0.99351268874530452,0.84741897665490395,9.259181524819364E-2,0.51305691617040217,1.0532423930280719,null,1.5431114893672675,0.86893942323288631,1.1002261484375473]
["France",null,"Western Europe","Accelerate High",0.98401679929624353,0.88560973115515806,0.99869432298720207,0.98344875961207123,0.77835754665732637,null,0.39070837032444794,0.75520104480935457,1.1690423655460311]
["Malta","Y","Western Europe","Accelerate High",0.93602316752299997,0.85662854250138087,0.34908731294285911,0.32911619526382141,0.63722671399046327,null,1.2446412427703564,1.2030381902914959,1.050583966552787]
["Belgium",null,"Western Europe","Accelerate High",0.8813886413176818,0.85898744006760985,1.2196428532330477,0.46227856381166393,0.95284891464777877,null,0.13158194431711953,0.77643785936440124,0.93757482698137917]
["Lithuania",null,"Eastern Europe","Accelerate High",0.88045244603564843,0.63023599860069657,0.1941849408216256,1.1869092517286342,1.1335594366222124,null,4.1757057857820239E-2,1.1176014887911041,1.0294328631864147]
["Czech Republic",null,"Eastern Europe","Accelerate High",0.82972311073738925,0.7853905804742114,0.41337320411259643,1.0013414020292246,1.1211610211262351,null,-6.9598487611861923E-2,0.6267371794813078,1.1479635796080891]
["Slovenia",null,"Eastern Europe","Accelerate High",0.82500372096334529,0.86066978943630146,0.43937641386029047,1.0527528381261795,1.1246390944422686,null,-0.11649182658867856,0.69611233549413654,0.94072030657617367]
["Portugal",null,"Western Europe","Accelerate High",0.79861248937400497,0.86902569173488131,0.79237036439178332,0.9560946547287279,0.73077141326247208,null,0.23854498743324254,0.45869724836362696,0.79239950434347628]
["Latvia",null,"Eastern Europe","Accelerate High",0.77193052663821071,0.62359013526197216,0.26869072795728194,0.95746170785504403,1.1383692031565502,null,0.26704130082963989,0.42973419291136217,0.99138029289386342]
["Poland",null,"Eastern Europe","Accelerate High",0.73183838738720319,0.75048150459578222,0.52997833477473022,0.45600048993558723,1.0727343089420827,null,-0.39835856148692994,0.68282565833439601,1.3397321943285321]
["Qatar",null,"Middle East","Accelerate High",0.72799675733205671,0.78289521588583766,0.24026856505336863,1.0299577566206164,1.0118916933911293,null,0.20663388453099232,0.73867805153857924,0.39979660333260147]
["Chile",null,"LATAM","Accelerate High",0.64751610818679806,0.77763029902072089,0.55390506035285014,0.75028535765986004,0.49450149126550941,null,0.49169418279291155,0.37015376403490713,0.48440897260747151]
["Slovakia",null,"Eastern Europe","Accelerate High",0.61019973765261648,0.69893207089491316,0.15821488767681066,0.6816623859321661,0.82492736792369015,null,-0.10350379110214905,0.72492322716315594,0.71136463980129161]
["Italy",null,"Western Europe","Accelerate High",0.55649073683282213,0.92558356699418753,0.54521265022507814,0.37450169090762947,0.42299446499636162,null,-0.14873009081604127,0.65969260656785411,0.59190286531649949]
["Mauritius","Y","Africa","Accelerate High",0.55171036879805635,0.51804477756154499,0.24353764268469932,1.0727605962107465,0.32613116707719514,null,0.48514973911658055,0.35057868962427174,0.34599621465745667]
["Montenegro",null,"Eastern Europe","Accelerate High",0.52918119411282383,0.69092187707628361,-2.7729395999798782E-2,-7.3619928683193891E-2,0.30070567708514367,null,0.96649191607587903,0.94593316769945024,0.40301632919506525]
{"$rows_left_out":107}