{"text_format":"1","workbook":"xlsx","n_sheets":9,"sheets":["Info","Digital Twin Strategy Canvas","ROI Calculator","Results","Use-Cases","Mapping (v3)","Costs_Data","Benefits_Data","Dropdown"],"not_rendered":{"charts":2,"images":29,"macros":1,"external_links":0,"defined_names":32,"comments":0,"pivot_tables":0},"unopened":[],"bounds":{"document_bytes":16777216,"sheet_cells":100000,"rows_first":2000,"rows_last":500,"rows_between":2000,"halvings":0,"cell_chars":16384,"cell_head_chars":4096},"cells_cut":0,"cells_raw":0,"read":"whole","date_system":"1900"}

{"sheet":"Info","index":0,"n_rows":28,"n_cols":5,"rows_kept":28,"cut":false,"hidden":false,"merged":[[2,3,3,14],[7,4,8,18],[10,3,13,3],[10,4,25,10],[27,3,30,3],[27,4,30,10]]}
[]
[]
[null,null,null,"INFORMATION - HOW TO ENABLE TOOL FUNCTIONALITY"]
[]
[]
[]
[]
[null,null,null,"Background","When downloaded onto a computer, the Digital Twin Strategy Canvas and ROI Calculator may be automatically blocked by the computer's system as it is an external file downloaded from a potentially untrusted source. Blocked files will be unable to access or use the built in macro functions that enable this tool to work. To enable content, follow instructions below."]
[]
[]
[null,null,null,"How to enable the file:","The Digital Twin Strategy Canvas and ROI Calculator (\"Excel file\") should be first downloaded only from a trusted source from either within ADB, or trusted and authorized third parties. The excel file can have its contents enabled by the following 2 primary steps:\n\n1. Unblock the file on the computer system. On windows devices, this can be done through right-clicking on the file, navigating to the \"General\" or \"Security\" tab, and unchecking the box titled \"Unblock\".  An example visual of this process is shown to the right.\n\n2. When opening the excel file, enable macro contents to ensure that all buttons and links within the file work as intended.\n\nIf any issues persist, please contact the relevant departments within your organization for assistance. "]
[]
[]
[]
[]
[]
[]
[]
[]
[]
{"$rows_left_out":9}
{"sheet":"Digital Twin Strategy Canvas","index":1,"n_rows":319,"n_cols":19,"rows_kept":319,"cut":false,"hidden":false,"merged":[[318,2,320,9],[318,11,320,19],[2,3,3,14],[209,9,227,18],[53,11,62,15],[53,16,74,19],[279,2,279,4],[12,4,12,18],[183,5,185,7],[183,8,185,18],[195,5,197,7],[174,8,175,18],[177,8,178,18],[180,8,181,18],[192,5,194,7],[189,5,191,7],[189,8,191,18],[230,9,248,18],[250,9,268,18],[204,2,204,7],[204,8,204,19],[192,8,193,18],[195,8,196,18],[70,3,71,5],[58,6,60,10],[70,6,72,10],[73,3,75,5],[73,6,75,10],[58,3,59,5],[64,3,65,5],[67,3,68,5],[64,6,66,10],[67,6,69,10],[129,4,133,18],[123,3,126,3],[123,4,126,18],[148,3,152,3],[148,4,152,18],[9,3,10,3],[9,4,11,18],[118,3,121,3],[88,4,90,18],[92,3,96,3],[92,4,96,18],[118,4,121,18],[29,2,45,7],[29,8,45,13],[29,14,45,19],[27,2,27,7],[27,8,27,13],[55,3,57,5],[61,3,63,5],[61,6,63,10],[48,2,48,10],[27,14,27,19],[48,16,48,19],[48,11,48,15],[55,6,56,10],[160,3,164,3],[160,4,164,18],[52,6,53,10],[52,3,54,5],[154,3,157,3],[154,4,157,18],[99,3,103,3],[99,4,103,18],[84,4,86,18],[143,4,146,18],[129,3,133,3],[113,4,116,18],[186,5,188,7],[186,8,188,18],[174,5,176,7],[177,5,179,7],[180,5,182,7]]}
[]
[]
[null,null,null,"STEP 1: CONCEPTUALIZE - DIGITAL TWIN STRATEGY CANVAS"]
[]
[]
[]
[]
[null,null,null,"Objective:","To conceptualize the Digital Twin Lite using the Digital Twin Strategy Canvas."]
[]
[null,null,null,"How it works:","The Digital Twin Strategy Canvas (\"Canvas\") is a planning tool that Project Team Members can utilize in order to logically conceptualize the Digital Twin Lite. The Canvas is comprised of 6 sections and sections 1-4 should be filled in by Project Team Members in order, whereas sections 5-6 are automatically completed by this tool based on inputs from the previous sections. Furthermore, to facilitate the use of this Canvas, a Digital Twin initiative with ADB for Indonesia's new capital Nusantara is used as guidance."]
[]
[]
[null,null,null,"Instructions:","This Canvas should be completed by ADB Project Teams, with optional participation and inputs from DMC Counterparts."]
[]
[null,null,null,"Go to:","1.) Project Summary"]
[null,null,null,null,"2.) Project Vision & Strategy"]
[null,null,null,null,"3.) Project Outputs and Outcomes"]
[null,null,null,null,"4.) Desired Solution & Benefits"]
[null,null,null,null,"5.) Indicative Maturity Level"]
[null,null,null,null,"6.) Past Success Stories"]
{"$rows_left_out":300}
{"sheet":"ROI Calculator","index":2,"n_rows":223,"n_cols":27,"rows_kept":223,"cut":false,"hidden":false,"merged":[[167,3,167,15],[167,17,167,18],[148,17,149,17],[159,19,159,20],[160,19,160,20],[161,19,161,20],[162,19,162,20],[163,19,163,20],[154,19,154,20],[155,19,155,20],[156,19,156,20],[157,19,157,20],[158,19,158,20],[222,7,224,14],[155,3,155,15],[170,3,170,15],[170,17,170,18],[163,17,163,18],[162,3,162,15],[163,3,163,15],[158,17,158,18],[159,17,159,18],[160,17,160,18],[161,17,161,18],[162,17,162,18],[214,3,214,12],[214,15,214,17],[178,3,178,18],[182,3,192,7],[2,3,3,19],[35,4,35,14],[36,4,36,14],[174,3,174,15],[37,4,40,14],[41,4,45,14],[156,3,156,15],[157,3,157,15],[158,3,158,15],[159,3,159,15],[151,3,151,15],[152,3,152,15],[153,3,153,15],[154,3,154,15],[160,3,160,15],[161,3,161,15],[8,4,8,5],[83,3,83,15],[83,17,83,18],[56,17,56,18],[57,3,57,15],[10,4,11,18],[26,4,31,18],[13,4,24,18],[37,3,39,3],[60,3,79,15],[54,17,54,18],[209,26,209,28],[199,3,199,6],[199,12,199,14],[199,8,199,10],[199,15,199,17],[209,15,209,17],[87,3,104,15],[111,3,111,15],[115,3,115,18],[136,3,136,5],[136,6,136,7],[136,11,136,12],[136,8,136,10],[136,13,136,14],[107,17,107,18],[131,3,131,5],[131,6,131,7],[119,3,129,7],[136,15,136,17],[142,19,142,20],[205,19,205,20],[194,3,194,5],[194,6,194,7],[151,17,151,18],[152,17,152,18],[153,17,153,18],[154,17,154,18],[155,17,155,18],[156,17,156,18],[157,17,157,18],[146,3,146,15],[146,17,146,18],[151,19,151,20],[152,19,152,20],[153,19,153,20]]}
[]
[]
[null,null,null,"STEP 2: BUSINESS CASE - ASSESS THE ROI POTENTIAL FOR THE DIGITAL TWIN LITE"]
[]
[]
[]
[]
[]
[null,null,null,"Date:","1st March, 2024"]
[]
[null,null,null,"Purpose:","Given the diverse purposes, project locations, and multitude of technologies inherent in digital twin creation, alongside the unquantifiable benefits they offer, it becomes challenging to accurately predict a return on investment (ROI). This model endeavors to provide indicative figures to assist in the initial decision-making process for the digital twin journey. "]
[]
[]
[null,null,null,"Disclaimer:","This model (\"ROI calculator\") prepared by AWR Lloyd Limited (\"AWR Lloyd\") is strictly confidential. Save as specifically agreed in writing by AWR Lloyd, the ROI calculator must not be copied, reproduced, distributed, or passed, in whole or in part, to any individual or entity. The ROI calculator should not be used for any other purpose without the prior written consent of AWR Lloyd.\n\nThis ROI calculator has been prepared partly on the basis of information from publicly available information and information attained from the client which is believed to be accurate and reliable. This information, which does not purport to be comprehensive, has not been independently verified by AWR Lloyd. The ROI calculator is based on various assumptions, data inputs, and methodologies. While AWR Lloyd has exercised due care and skill in developing the ROI calculator to maximize indicative accuracy, it is not immune to inherent uncertainties and limitations. It is not intended as definitive predictions to be used in isolation, but instead as tools for analysis. It is not intended to provide the primary basis of any investment decision, credit, legal, financial or other evaluation and should not be regarded as a recommendation or taken as a commitment to future outcomes.\n\nIn particular, but without prejudice to the generality of the foregoing, no representation or warranty is given as to the achievement or reasonableness of any future projections, estimates, prospects or returns contained in the ROI calculator. This ROI calculator and any presentation made in relations to this ROI calculator does not constitute an offer or invitation for the sale or purchase of securities, or any businesses or assets described in it, nor does it purport to give legal, tax, or financial advice. The findings, interpretations, conclusions, projections, and the underlying information of the ROI calculator does not necessarily reflect the views of AWR Lloyd and its partners."]
[]
[]
[]
[]
[]
[]
{"$rows_left_out":204}
{"sheet":"Results","index":3,"n_rows":81,"n_cols":27,"rows_kept":81,"cut":false,"hidden":false,"merged":[[75,15,75,17],[80,3,80,12],[80,15,80,17],[71,3,71,6],[71,8,71,10],[71,15,71,17],[71,12,71,14],[67,15,67,17],[48,3,49,5],[54,3,55,5],[54,6,56,10],[57,3,59,5],[57,6,59,10],[67,3,67,5],[67,6,67,7],[67,8,67,10],[67,11,67,12],[67,13,67,14],[32,2,32,10],[32,11,32,15],[32,16,32,19],[36,3,38,5],[36,6,37,10],[37,11,46,15],[37,16,58,19],[39,3,41,5],[39,6,40,10],[42,3,43,5],[42,6,44,10],[45,3,47,5],[45,6,47,10],[48,6,50,10],[51,6,53,10],[51,3,53,5],[2,3,3,17],[11,2,11,7],[11,8,11,13],[11,14,11,19],[13,2,29,7],[13,8,29,13],[13,14,29,19]]}
[]
[]
[null,null,null,"RESULTS: SUMMARIZED OUTPUTS FROM STEP 1: CONCEPTUALIZE, AND STEP 2: BUSINESS CASE"]
[]
[]
[]
[]
[null,null,"STEP 1: CONCEPTUALIZE - DIGITAL TWIN STRATEGY CANVAS"]
[]
[]
[]
[null,null,"1.) PROJECT SUMMARY",null,null,null,null,null,"2.) PROJECT VISION & STRATEGY",null,null,null,null,null,"3.) PROJECT OUTPUT AND OUTCOMES"]
[]
[null,null,{"$f":"IF('Digital Twin Strategy Canvas'!E100=0,\"[Complete Canvas inputs below]\",'Digital Twin Strategy Canvas'!E100)","v":"[Complete Canvas inputs below]"},null,null,null,null,null,{"$f":"IF('Digital Twin Strategy Canvas'!E130=0,\"[Complete Canvas inputs below]\",'Digital Twin Strategy Canvas'!E130)","v":"[Complete Canvas inputs below]"},null,null,null,null,null,{"$f":"IF('Digital Twin Strategy Canvas'!E161=0,\"[Complete Canvas inputs below]\",'Digital Twin Strategy Canvas'!E161)","v":"[Complete Canvas inputs below]"}]
[]
[]
[]
[]
[]
[]
{"$rows_left_out":62}
{"sheet":"Use-Cases","index":4,"n_rows":416,"n_cols":13,"rows_kept":416,"cut":false,"hidden":false,"merged":[[299,0,299,1],[386,0,386,1],[0,0,2,0],[4,0,4,1],[155,0,155,1]]}
["Return"]
[null,null,null,"Sectors:","Water & Urban Development",null,null,null,"Transport",null,"Energy",null,"Others"]
[]
[]
["Water & Urban Dev."]
[null,"Level 1"]
[]
[]
[]
[]
[]
[]
[]
[]
[]
[]
[]
[]
[]
[]
{"$rows_left_out":397}
{"sheet":"Mapping (v3)","index":5,"n_rows":22,"n_cols":19,"rows_kept":22,"cut":false,"hidden":true,"merged":[]}
["BENEFIT AND MATURITY MAPPING PER SOLUTION"]
[]
["Status","No.","Desired Solution","Maturity","Maturity Check","Visualization and Monitoring","Informed Decision Making","Resource optimization and loss reduction","Productivity gains","Improve O&M","Improve or optimize financial performance","Improve quality","Increase customer satisfaction","Improved knowledge and collaboration","Security and safety","Predictive Intelligence","Risk management and resilience","Improved environmental sustainability"]
[{"$f":"'Digital Twin Strategy Canvas'!D175","v":0},1,"Stress test the potential infrastructure against current built environment",2,{"$f":"IF(A4=\"Yes\",D4,\"-\")","v":"-"},{"$f":"IF($A4=\"Yes\", TRUE, FALSE)","v":false},{"$f":"IF($A4=\"Yes\", TRUE, FALSE)","v":false},"-","-","-","-","-","-",{"$f":"IF($A4=\"Yes\", TRUE, FALSE)","v":false},"-","-","-","-",{"$f":"COUNTIF(F4:R4,TRUE)","v":0}]
[{"$f":"'Digital Twin Strategy Canvas'!D178","v":0},2,"Stress test against future conditions and environments (e.g. climate change)",3,{"$f":"IF(A5=\"Yes\",D5,\"-\")","v":"-"},"-",{"$f":"IF($A5=\"Yes\", TRUE, FALSE)","v":false},"-","-","-","-",null,"-","-",false,false,false,{"$f":"IF($A5=\"Yes\", TRUE, FALSE)","v":false},{"$f":"COUNTIF(F5:R5,TRUE)","v":0}]
[{"$f":"'Digital Twin Strategy Canvas'!D181","v":0},3,"Evaluate and optimize design to meet specific outcomes(s)",3,"-",{"$f":"IF($A6=\"Yes\", TRUE, FALSE)","v":false},"-",false,false,"-",false,false,"-","-","-","-","-",false,0]
[{"$f":"'Digital Twin Strategy Canvas'!D184","v":0},4,"Urban planning tool to conceptualize different urban designs and analyze various scenarios",2,"-",false,false,false,"-","-",false,false,"-","-","-","-","-",false,0]
[{"$f":"'Digital Twin Strategy Canvas'!D187","v":0},5,"Collaborate, visualize, or experience virtually",1,"-",false,"-","-",false,"-",false,"-",false,false,"-","-","-","-",0]
[{"$f":"'Digital Twin Strategy Canvas'!D190","v":0},6,"Immerse and experience virtually",1,"-",false,false,"-","-","-","-","-",false,false,"-","-","-","-",0]
[{"$f":"'Digital Twin Strategy Canvas'!D193","v":0},7,"Conduct immersive training",1,{"$f":"IF(A10=\"Yes\",D10,\"-\")","v":"-"},{"$f":"IF($A10=\"Yes\", TRUE, FALSE)","v":false},"-","-",false,"-","-","-","-",false,false,"-","-","-",0]
[{"$f":"'Digital Twin Strategy Canvas'!D196","v":0},8,"Monitor the construction and building of the infrastructure",1,"-",false,false,false,false,"-","-","-","-","-","-","-",false,"-",0]
[]
[null,null,"Maturity Choice",null,"Level","Name","Append 1","Append 2","Concatenate","for ROI"]
[null,null,null,null,1,"Descriptive Twin"]
[null,null,null,null,2,"Informative Twin"]
[null,null,null,null,3,"Predictive Twin"]
[null,null,null,null,4,"Prescriptive Twin"]
[null,null,null,null,5,"Autonomous Twin"]
[null,null,"FINAL MATURITY",null,{"$f":"MAX(E4:E11)","v":0},{"$f":"VLOOKUP(E19,E14:F18,2)","v":{"$error":"#N/A"}},"Level ",": ",{"$f":"_xlfn.CONCAT(G19,E19,H19,F19)","v":{"$error":"#N/A"}},{"$f":"_xlfn.CONCAT(G19,E19)","v":"Level 0"}]
[]
{"$rows_left_out":3}
{"sheet":"Costs_Data","index":6,"n_rows":77,"n_cols":14,"rows_kept":77,"cut":false,"hidden":true,"merged":[]}
[]
[]
[null,"MULTIPLIER BETWEEN ASSET SCALES",null,null,"Asset Size (Unit: '000)"]
[null,"Maturity Level / Project Name","Small","Medium","Large",null,"Highlighted Text","Used in the calculation of differential multiplier"]
[null,"Median cost across all Maturity Levels",{"$f":"MEDIAN(C18:C32,C53:C54)","v":1000},{"$f":"MEDIAN(D19:D31,D40:D45,D55:D64)","v":5984.5},{"$f":"MEDIAN(E28:E35,E57:E66)","v":13750},null,"Blue Text","Derived from multipliers to use as final number or for further calculations"]
[null,"DIFFERENTIAL MULTIPLIER (x)",{"$f":"C5/D5","v":0.16709833737154314},"-",{"$f":"E5/D5","v":2.2976021388587182},null,"Red Text","Not enough data to derive median cost / Outlier data"]
[null,null,null,null,null,null,"Black Text","Used in the calculation of the median cost"]
[null,"SUMMARY",null,null,"Asset Size (Unit: '000)"]
[null,"Maturity Level / Project Name","Small","Medium","Large"]
[null,"Level 1",{"$f":"C36","v":650},{"$f":"D36","v":1004},{"$f":"E36","v":2370}]
[null,"Level 2",{"$f":"C48","v":1052.7195254407218},{"$f":"D48","v":6300},{"$f":"E48","v":14474.893474809925}]
[null,"Level 3",{"$f":"C68","v":5638.5},{"$f":"D68","v":10000},{"$f":"E68","v":25000}]
[]
[null,"HIGH-LEVEL COST OF A DIGITAL TWIN BY MATURITY LEVEL AND ASSET SCALE",null,null,"Asset Size (Unit: '000)"]
[null,"Maturity Level / Project Name","Single","Multiple","City",null,null,null,null,null,null,null,{"$f":"160/2","v":80}]
[null,"Level 1"]
[null,"Gulf Power (Operating division of NextEra Energy) LiDAR scan",50]
[null,"Digital Twin of Sello Building Block",54.5]
[null,"Digital Twin of Sirnach Municipality",null,54.5]
[null,"Digital Twin of the municipality of Fällanden, Switzerland",null,54.5]
{"$rows_left_out":58}
{"sheet":"Benefits_Data","index":7,"n_rows":256,"n_cols":40,"rows_kept":256,"cut":false,"hidden":true,"merged":[[1,0,2,6]]}
["BENEFIT CALCULATION"]
["This tab provides an overview of primary benefits realized from Digital Twins in terms of cost savings. Benefits are broken down into two main categories of lifecycle phases (D&B, O&M) as well as additional benefits throughout the entire project (emissions savings, etc.).",null,null,null,null,null,null,null,null,"CALCULATION DATA"]
[]
[null,"Question","Input","Recommended Metric",null,null,null,null,null,"Legend",null,null,null,null,null,null,null,null,null,null,null,null,null,null,null,"Processed Data (10%<x<60%)",null,null,null,null,null,null,null,null,null,null,null,null,null,"Note: Paste metric data from use-case library (pivot table) as values, then delete all values above a 60%"]
[null,"Scenario",null,null,null,null,null,null,null,"Conservative","Min",null,null,null,null,null,null,null,null,null,null,null,null,null,null,"Maturity","Visual","Decision","Resource","Productivity","Maintenance","Financials","Quality","Customer","Knowledge","Security","Prediction","Risk","Environment","Others"]
[null,"Phase","D&B",null,null,null,null,null,null,"Moderate","Q1",null,null,null,null,null,null,null,null,null,null,null,null,null,null,2]
[null,"Maturity Level",{"$f":"'Mapping (v3)'!J19","v":"Level 0"},null,null,null,null,null,null,"Optimistic","Median",null,null,null,null,null,null,null,null,null,null,null,null,null,null,3]
[null,"Benefit Cap","Max Cleaned",null,null,null,null,null,null,null,null,null,null,null,null,null,null,null,null,null,null,null,null,null,null,2]
[null,null,null,null,null,null,null,null,null,null,null,null,null,null,null,null,null,null,null,null,null,null,null,null,null,2]
[null,"Design and Build (D&B)",null,null,null,null,null,null,null,null,null,null,null,null,null,null,null,null,null,null,null,null,null,null,null,2]
[null,"What is the total estimated capital expenditure (CAPEX) for the infrastructure project?",{"$f":"'ROI Calculator'!R147:S147","v":0},0,null,null,null,null,null,"Transformed Data",null,null,null,null,null,null,null,null,null,null,"Automation (tentative)",null,null,null,null,2]
[null,"Visualization and monitoring",{"$f":"IF('ROI Calculator'!R152=\"Yes\",D12)","v":false},{"$f":"INDEX($K$15:$M$27,MATCH($B12,$J$15:$J$27,0),MATCH($C$7,$K$14:$M$14,0))","v":{"$error":"#N/A"}},null,null,null,null,null,null,null,null,null,null,null,null,null,null,null,null,null,null,null,null,null,3]
[null,"Informed decision-making",{"$f":"IF('ROI Calculator'!R153=\"Yes\",D13)","v":false},"-",null,null,null,null,null,"DATA SUMMARY",null,null,null,null,null,null,null,null,null,null,null,null,null,null,null,2]
[null,"Resource optimization and loss reduction",{"$f":"IF('ROI Calculator'!R154=\"Yes\",D14)","v":false},{"$f":"INDEX($K$15:$M$27,MATCH($B14,$J$15:$J$27,0),MATCH($C$7,$K$14:$M$14,0))","v":{"$error":"#N/A"}},null,"Benefit Range",null,null,null,"Benefit","Level 1","Level 2","Level 3",null,null,"Benefits quantified in US$M","Level 1","Level 2","Level 3",null,"Formula to automate from pasted data set:",null,null,null,null,3]
[null,"Productivity gains",{"$f":"IF('ROI Calculator'!R155=\"Yes\",D15)","v":false},{"$f":"INDEX($K$15:$M$27,MATCH($B15,$J$15:$J$27,0),MATCH($C$7,$K$14:$M$14,0))","v":{"$error":"#N/A"}},null,"Minimum",{"$f":"IFERROR($G$16-(INDEX(Benefits_Data!$K$15:$M$28,MATCH(\"Standard deviation\",Benefits_Data!$J$15:$J$28,0),MATCH($C$7,Benefits_Data!$K$14:$M$14,0))),\"-\")","v":"-"},null,null,"Visualization and monitoring","-","-","-",null,null,1,3600000,2300000,3000000,null,"Need to manually delete outliers and apply multipliers",null,null,null,null,3]
[null,"Improve operations, inspection, maintenance",{"$f":"IF('ROI Calculator'!R156=\"Yes\",D16)","v":false},{"$f":"INDEX($K$15:$M$27,MATCH($B16,$J$15:$J$27,0),MATCH($C$7,$K$14:$M$14,0))","v":{"$error":"#N/A"}},null,"Median",{"$f":"MEDIAN(C12:C23)","v":{"$error":"#NUM!"}},null,null,"Informed decision-making",0.47,0.57254545454545447,0.8102356902356902,null,null,2,null,16000000,390000,null,null,null,null,null,null,2]
[null,"Improve or optimize financial performance",{"$f":"IF('ROI Calculator'!R157=\"Yes\",D17)","v":false},{"$f":"INDEX($K$15:$M$27,MATCH($B17,$J$15:$J$27,0),MATCH($C$7,$K$14:$M$14,0))","v":{"$error":"#N/A"}},null,"Maximum",{"$f":"IFERROR($G$16+(INDEX(Benefits_Data!$K$15:$M$28,MATCH(\"Standard deviation\",Benefits_Data!$J$15:$J$28,0),MATCH($C$7,Benefits_Data!$K$14:$M$14,0))),\"-\")","v":"-"},null,null,"Resource optimization and loss reduction",0.17238805970149257,0.21,0.32500000000000001,null,null,3,null,8400000,100000000,null,"Formula","Data","Check",null,null,3,null,null,null,0.5,null,0.33,null,0.4,null,0.37,null,null,0.5]
[null,"Improve quality",{"$f":"IF('ROI Calculator'!R158=\"Yes\",D18)","v":false},{"$f":"INDEX($K$15:$M$27,MATCH($B18,$J$15:$J$27,0),MATCH($C$7,$K$14:$M$14,0))","v":{"$error":"#N/A"}},null,null,null,null,null,"Productivity gains",0.27500000000000002,0.33499999999999996,0.5,null,null,4,null,7600000,840000,null,{"$f":"MEDIAN(IF((Z6:Z1000=2)*(AD6:AD1000<>\"\"),AD6:AD1000))","v":0.33499999999999996},0.13,{"$f":"MEDIAN(V18:V31)","v":0.33499999999999996},null,null,1]
[null,"Increase customer satisfaction",{"$f":"IF('ROI Calculator'!R159=\"Yes\",D19)","v":false},{"$f":"INDEX($K$15:$M$27,MATCH($B19,$J$15:$J$27,0),MATCH($C$7,$K$14:$M$14,0))","v":{"$error":"#N/A"}},null,null,null,null,null,"Improve operations, inspection, maintenance",0.22500000000000001,0.35,0.51786069651741296,null,null,5,null,1300000,99000000,null,null,0.5,null,null,null,2]
[null,"Improved knowledge and collaboration",{"$f":"IF('ROI Calculator'!R160=\"Yes\",D20)","v":false},{"$f":"INDEX($K$15:$M$27,MATCH($B20,$J$15:$J$27,0),MATCH($C$7,$K$14:$M$14,0))","v":{"$error":"#N/A"}},null,null,null,null,null,"Improve or optimize financial performance",0.20250000000000001,0.22500000000000001,0.33,null,null,6,null,1200000,1114000000,null,null,0.37,null,null,null,2]
{"$rows_left_out":237}
{"sheet":"Dropdown","index":8,"n_rows":46,"n_cols":2,"rows_kept":46,"cut":false,"hidden":true,"merged":[]}
[]
[null,"Yes/No"]
[null,"Yes"]
[null,"No"]
[]
[null,"Phase"]
[null,"Select Input"]
[null,"D&B"]
[null,"O&M"]
[null,"Entire"]
[]
[null,"MATURITY LEVEL"]
[null,"-"]
[null,"Level 1: Descriptive Twin"]
[null,"Level 2: Informative Twin"]
[null,"Level 3: Predictive Twin"]
[]
[null,"ASSET SCALE"]
[null,"-"]
[null,"Small"]
{"$rows_left_out":26}